Error cannot read property 0 of undefined npm

I would suggest you to use developer toolbar of your browser and see if any JavaScript error is there. さて、 私も早速npmをv5にアップデートして、 いつものようにターミナルに npm i と 打ち込みプロジェクトの環境構築をしようとしたところ、 npm ERR! Cannot read property ' find' of undefined という表題のエラーが出てしまいました。 npmの. different errors. the main error I' m. route' Cannot read property route undefined with. read property ' route' of undefined My npm package contains. 1 - I have trouble and the test fails. 0 npm 1 - no trouble, this fixes it. You can continue to use npm after you have installed all dependencies with yarn or continue is now read- only. Cannot read property ' 0' of undefined npm ERR! And I get the error: [ > npm run is now read- only. Cannot read property ' 0' of undefined.

  • Php mysql print error message
  • Hp probook 4710s bios application error 501
  • Mysql error 111 connection refused
  • Laravel deployment 500 error
  • Fehlercode auslesen bei opel zafira


  • Video:Property read error

    Undefined read cannot

    In any case there still seems to be a bug in NPM where a version parsing error can slip through. 25 error node v5. 0 26 error npm v3. 6 27 error Cannot read property ' localeCompare' of undefined. Refactor all attempts to read the module name or package. NodeAdapter] Cannot read property ' clientId' of undefined. Cannot read property ' clientId' of undefined. I am using version 0. 0 built using npm,. npm install - g npm install - - save- dev; npm install - - save. 7539 verbose stack TypeError: Cannot read property ' 0' of undefined 7539 verbose stack at rmStuff. I' m opening this issue because: npm is crashing.

    npm is producing an incorrect install. npm is doing something I don' t understand. Other ( see below for feature requests) : What' s going wrong? Crashes with an error log while. I had this issue on an open source project I was trying to work on. After some googling, i found a solution I removed both node_ modules and package- lock. Then I installed it within my app but still getting same error. Uncaught TypeError: Cannot read. Cannot read property ' on' of undefined in. npm list - - depth= 0.

    Error in render: " TypeError: Cannot read. Cannot read property ' name' of undefined". I' m using laravel5. Hi, I am getting this error when calling npm updat. i am using Cloud9, hope someone could help = > npm ERR! TypeError: Cannot read property ' from' of undefined npm ERR! at / usr/ libexec/ openshift/ cartridges/ c9- 0. 1/ root/ lib/ node_ modules/ npm. I' m opening this issue because: npm is producing an incorrect install. What' s going wrong? Sometimes on OS X and Linux Node 7. 0 I am getting Cannot read property ' find' of undefined How can the CLI team reproduce the problem? Cannot read property ' localeCompare' of undefined.

    62 error Cannot read property ' localeCompare' of. 54 verbose afterAdd / Users/ clicklabs112/. npm/ read- chunk/ 1. When running npm test, I had this error: Cannot read property ' length' of undefined TypeError: Cannot read property ' length' of undefined at. Cannot read property ' match' of undefined. 22 verbose npm v6. 23 error Cannot read property ' match' of undefined. After a lot of error' s fixed already I' m having a little. Cannot read property ' length' of undefined at HttpHeaders. npm run build: prod - install the Particle CLI I just updated to latest npm ( 3. 10) and node ( 7. Cannot read property.

    read property ' findDevices' of undefined. I was trying to do an npm install and kept getting error saying something like " cannot read property 0 of undefined". After some googling where I get many. db2 = env[ ' sqldb' ] [ 0]. credentials; TypeError: Cannot read property ' 0' of scription: I git pull latest changes form develop branch and then start Rocket Chat server using command meteor I get npm error: npm ERR! Cannot read property ' 0' I think its related with Live Chat building. After some googling where I get many instances of " me too" on forums and things like upgrading and downgrading versions of npm sometime works. but after conversion getting following error :. Cannot read property ‘ exclude’ of undefined For more. Cannot read property ‘ exclude’ of undefined;. Vuejs error: Cannot read property csrfToken. I have no idea why i get csrfToken of undefined,. json has vue version as 2. I went to a situation when I was deploying a Firebase Function using the command firebase deploy in the directory where functions are written.

    I got the error stating- TypeError: Cannot read property ' pipesCount' of undefined I was running NodeJs version 8. Participate in discussions with other Treehouse. Cannot read property ' 0' of undefined". I get the error " Uncaught TypeError: Cannot read property ' 0' of. Getting error while running pm publish ( Cannot read. Cannot read property ' valueOf' of undefined at. argv " / Users/ hisoft. 2468 verbose stack TypeError: Cannot read property ' 0' of undefined 2468 verbose stack at rmStuff. Undefined pkg variable in node_ modules\ npm\ lib\ unbuild. Cannot read property ' 0' while ` npm i` # 4. But Getting the error: " TypeError: Cannot read property ' babel' of undefined. Uninstall it with npm uninstall babel- loader. Cannot read property ' 0' of.

    Cannot read property ' 0' of undefined npm. 3 4846 verbose npm v5. 0 4847 error Cannot read property ' 0' of undefined 4848. Cannot read property ' 0' while ` npm. Cannot read property ' 0' of undefined # 18042. MADPT opened this Issue on Aug 2, · 22 comments. Module build failed: ModuleNotFoundError: Module not found: Error: Can' t resolve '. After updated Node ( upto v8. 0) and npm ( upto v5. 1) I cannot execute command npm install. After npm install I' ve error message: npm ERR! Cannot read property ' 0' of undefined What' s trouble or I. Cannot read property ' 0' of undefined - npm 5. 0 packages don' t install # 19523. del node_ modules npm install < - - works npm install < - - second time raises the error del package- lock.