Error 20 identifier inline is undefined

" src/ APS2500_ Bootloader. c", line 55: error # 20: identifier " inline" is undefined ( see “ inline error snipper. Here is the workaround to fix the issue: 1. Open the file < coverity. Home > C and C+ + Compiler Errors and Warnings > List of the armcc error and warning messages. identifier < entity> is undefined. For example, when compiled for C+ +, the code: void foo( arg ) { }. results in the message: Error: # 20:. specific definition of inline template function must precede its first use. static inline unsigned _ _ get_ cpsr( void) { unsigned long retval; asm volatile ( " mrs % 0, cpsr" : " = r" ( retval) : ) ; return retval; }.

  • Cara mengatasi error 20 pes 2017 android
  • Opel zafira b fehlercode 02345a
  • Error 42408 itunes 10 7
  • Curl error 28 ssl connection timeout wordpress


  • Video:Error inline undefined

    Error identifier undefined

    error: # 65: expected a " ; " error: # 20: identifier " asm" is undefined. so i used _ _ inline and _ _ asm and now i get this error:. First, the compiler does not always inline functions marked as inline ; eg if you turn all optimizations off it will probably not inline them. When you define an inline function inline void do_ something( void) { blah }. and use looks like you are using C compilation for C+ + code - check the compiler options. In C+ + namespace is a reserved word, but not in C, so the compiler will try to interpret it as an identifier rather than a keyword - which will then. Clang defaults to C99 and not GNU sematics, which means a raw inline is different from both static inline and extern. In particular, a raw inline means that the function still has external linkage, but the inline definition does mcc で生成されるエラーおよび警告メッセージのリスト. Error: # 20: identifier < arg > is undefined. 次のコード例も、 このエラーを発生. 612 : inline template 関数の 特定の定義は、 その関数が初めて使用される前に指定する必要があります. cuda_ compile_ generated_ cuda_ kde_ depth_ packet_ processor. o nvcc warning : The ' compute_ 20',. / usr/ lib/ gcc/ x86_ 64- linux- gnu/ 4. 8/ include/ stddef.

    h( 432) : error: identifier " nullptr" is undefined / usr/ lib/ gcc/ x86_ 64- linux- gnu/ 4. h( 432) : error: expected a ". error: inline specifier allowed on function declarations only / usr/ include/ c+ + / 4. 8/ cmath( 80) : error: expected a ". c( 80) : error: # 20: identifier " SP" is undefined MOV SP, r1. If an ARM register name is used as an operand in an inline assembler instruction it becomes a reference to a variable of. for the sp ( r13), lr ( r14), and pc ( r15) registers, and they cannot be read or directly modified in inline assembly lated. error: # 20: identifier " NRF_ EVT_ FLASH_ OPERATION_ SUCCESS" is undefined error: # 20: identifier. I' m getting an error which says the identifier ble_ temperature_ t is undefined, and it is showing as an error in the keil ( unkown type name). However when I click. Sometimes the real- time syntax checking and the compiler will disagree, especially if your project is using inline assembly or such.